CRAN Package Check Results for Package econullnetr

Last updated on 2020-04-01 01:48:49 CEST.

Flavor Version Tinstall Tcheck Ttotal Status Flags
r-devel-linux-x86_64-debian-clang 0.2.0 4.10 79.64 83.74 ERROR
r-devel-linux-x86_64-debian-gcc 0.2.0 3.09 59.59 62.68 ERROR
r-devel-linux-x86_64-fedora-clang 0.2.0 102.32 ERROR
r-devel-linux-x86_64-fedora-gcc 0.2.0 98.77 ERROR
r-devel-windows-ix86+x86_64 0.2.0 8.00 98.00 106.00 ERROR
r-devel-windows-ix86+x86_64-gcc8 0.2.0 17.00 100.00 117.00 ERROR
r-patched-linux-x86_64 0.2.0 3.37 76.09 79.46 ERROR
r-patched-solaris-x86 0.2.0 135.80 ERROR
r-release-linux-x86_64 0.2.0 3.02 70.62 73.64 OK
r-release-windows-ix86+x86_64 0.2.0 9.00 121.00 130.00 OK
r-release-osx-x86_64 0.2.0 OK
r-oldrel-windows-ix86+x86_64 0.2.0 8.00 131.00 139.00 OK
r-oldrel-osx-x86_64 0.2.0 OK

Check Details

Version: 0.2.0
Check: tests
Result: ERROR
     Running 'testthat.R' [7s/10s]
    Running the tests in 'tests/testthat.R' failed.
    Complete output:
     > Sys.setenv("R_TESTS" = "")
     >
     > library(testthat)
     > library(econullnetr)
     >
     > test_check("econullnetr")
     -- 1. Failure: Consistent outputs (@test_generate_edgelist.R#24) --------------
     generate_edgelist(s.1, signif.level = 0.9) has changed from known value recorded in 'el1_090'.
     Component "Consumer": Modes: character, numeric
     Component "Consumer": Attributes: < target is NULL, current is list >
     Component "Consumer": target is character, current is factor
    
     -- 2. Failure: Consistent outputs (@test_generate_edgelist.R#26) --------------
     generate_edgelist(s.1, signif.level = 0.95) has changed from known value recorded in 'el1_095'.
     Component "Consumer": Modes: character, numeric
     Component "Consumer": Attributes: < target is NULL, current is list >
     Component "Consumer": target is character, current is factor
    
     -- 3. Failure: Consistent outputs (@test_generate_edgelist.R#28) --------------
     generate_edgelist(s.1, signif.level = 0.99) has changed from known value recorded in 'el1_099'.
     Component "Consumer": Modes: character, numeric
     Component "Consumer": Attributes: < target is NULL, current is list >
     Component "Consumer": target is character, current is factor
    
     -- 4. Failure: Consistent outputs (@test_generate_edgelist.R#30) --------------
     generate_edgelist(...) has changed from known value recorded in 'el2_095'.
     Component "Consumer": Modes: character, numeric
     Component "Consumer": Attributes: < target is NULL, current is list >
     Component "Consumer": target is character, current is factor
    
     -- 5. Failure: Consistent outputs (@test_generate_edgelist.R#33) --------------
     generate_edgelist(s.1, signif.level = 0.95, export.null = TRUE) has changed from known value recorded in 'el3_95'.
     Component "Consumer": Modes: character, numeric
     Component "Consumer": Attributes: < target is NULL, current is list >
     Component "Consumer": target is character, current is factor
    
     == testthat results ===========================================================
     [ OK: 32 | SKIPPED: 10 | WARNINGS: 0 | FAILED: 5 ]
     1. Failure: Consistent outputs (@test_generate_edgelist.R#24)
     2. Failure: Consistent outputs (@test_generate_edgelist.R#26)
     3. Failure: Consistent outputs (@test_generate_edgelist.R#28)
     4. Failure: Consistent outputs (@test_generate_edgelist.R#30)
     5. Failure: Consistent outputs (@test_generate_edgelist.R#33)
    
     Error: testthat unit tests failed
     Execution halted
Flavor: r-devel-linux-x86_64-debian-clang

Version: 0.2.0
Check: tests
Result: ERROR
     Running ‘testthat.R’ [6s/9s]
    Running the tests in ‘tests/testthat.R’ failed.
    Complete output:
     > Sys.setenv("R_TESTS" = "")
     >
     > library(testthat)
     > library(econullnetr)
     >
     > test_check("econullnetr")
     ── 1. Failure: Consistent outputs (@test_generate_edgelist.R#24) ──────────────
     generate_edgelist(s.1, signif.level = 0.9) has changed from known value recorded in 'el1_090'.
     Component "Consumer": Modes: character, numeric
     Component "Consumer": Attributes: < target is NULL, current is list >
     Component "Consumer": target is character, current is factor
    
     ── 2. Failure: Consistent outputs (@test_generate_edgelist.R#26) ──────────────
     generate_edgelist(s.1, signif.level = 0.95) has changed from known value recorded in 'el1_095'.
     Component "Consumer": Modes: character, numeric
     Component "Consumer": Attributes: < target is NULL, current is list >
     Component "Consumer": target is character, current is factor
    
     ── 3. Failure: Consistent outputs (@test_generate_edgelist.R#28) ──────────────
     generate_edgelist(s.1, signif.level = 0.99) has changed from known value recorded in 'el1_099'.
     Component "Consumer": Modes: character, numeric
     Component "Consumer": Attributes: < target is NULL, current is list >
     Component "Consumer": target is character, current is factor
    
     ── 4. Failure: Consistent outputs (@test_generate_edgelist.R#30) ──────────────
     generate_edgelist(...) has changed from known value recorded in 'el2_095'.
     Component "Consumer": Modes: character, numeric
     Component "Consumer": Attributes: < target is NULL, current is list >
     Component "Consumer": target is character, current is factor
    
     ── 5. Failure: Consistent outputs (@test_generate_edgelist.R#33) ──────────────
     generate_edgelist(s.1, signif.level = 0.95, export.null = TRUE) has changed from known value recorded in 'el3_95'.
     Component "Consumer": Modes: character, numeric
     Component "Consumer": Attributes: < target is NULL, current is list >
     Component "Consumer": target is character, current is factor
    
     ══ testthat results ═══════════════════════════════════════════════════════════
     [ OK: 32 | SKIPPED: 10 | WARNINGS: 0 | FAILED: 5 ]
     1. Failure: Consistent outputs (@test_generate_edgelist.R#24)
     2. Failure: Consistent outputs (@test_generate_edgelist.R#26)
     3. Failure: Consistent outputs (@test_generate_edgelist.R#28)
     4. Failure: Consistent outputs (@test_generate_edgelist.R#30)
     5. Failure: Consistent outputs (@test_generate_edgelist.R#33)
    
     Error: testthat unit tests failed
     Execution halted
Flavor: r-devel-linux-x86_64-debian-gcc

Version: 0.2.0
Check: tests
Result: ERROR
     Running ‘testthat.R’ [9s/25s]
    Running the tests in ‘tests/testthat.R’ failed.
    Complete output:
     > Sys.setenv("R_TESTS" = "")
     >
     > library(testthat)
     > library(econullnetr)
     >
     > test_check("econullnetr")
     ── 1. Failure: Consistent outputs (@test_generate_edgelist.R#24) ──────────────
     generate_edgelist(s.1, signif.level = 0.9) has changed from known value recorded in 'el1_090'.
     Component "Consumer": Modes: character, numeric
     Component "Consumer": Attributes: < target is NULL, current is list >
     Component "Consumer": target is character, current is factor
    
     ── 2. Failure: Consistent outputs (@test_generate_edgelist.R#26) ──────────────
     generate_edgelist(s.1, signif.level = 0.95) has changed from known value recorded in 'el1_095'.
     Component "Consumer": Modes: character, numeric
     Component "Consumer": Attributes: < target is NULL, current is list >
     Component "Consumer": target is character, current is factor
    
     ── 3. Failure: Consistent outputs (@test_generate_edgelist.R#28) ──────────────
     generate_edgelist(s.1, signif.level = 0.99) has changed from known value recorded in 'el1_099'.
     Component "Consumer": Modes: character, numeric
     Component "Consumer": Attributes: < target is NULL, current is list >
     Component "Consumer": target is character, current is factor
    
     ── 4. Failure: Consistent outputs (@test_generate_edgelist.R#30) ──────────────
     generate_edgelist(...) has changed from known value recorded in 'el2_095'.
     Component "Consumer": Modes: character, numeric
     Component "Consumer": Attributes: < target is NULL, current is list >
     Component "Consumer": target is character, current is factor
    
     ── 5. Failure: Consistent outputs (@test_generate_edgelist.R#33) ──────────────
     generate_edgelist(s.1, signif.level = 0.95, export.null = TRUE) has changed from known value recorded in 'el3_95'.
     Component "Consumer": Modes: character, numeric
     Component "Consumer": Attributes: < target is NULL, current is list >
     Component "Consumer": target is character, current is factor
    
     ══ testthat results ═══════════════════════════════════════════════════════════
     [ OK: 32 | SKIPPED: 10 | WARNINGS: 0 | FAILED: 5 ]
     1. Failure: Consistent outputs (@test_generate_edgelist.R#24)
     2. Failure: Consistent outputs (@test_generate_edgelist.R#26)
     3. Failure: Consistent outputs (@test_generate_edgelist.R#28)
     4. Failure: Consistent outputs (@test_generate_edgelist.R#30)
     5. Failure: Consistent outputs (@test_generate_edgelist.R#33)
    
     Error: testthat unit tests failed
     Execution halted
Flavor: r-devel-linux-x86_64-fedora-clang

Version: 0.2.0
Check: tests
Result: ERROR
     Running ‘testthat.R’ [9s/22s]
    Running the tests in ‘tests/testthat.R’ failed.
    Complete output:
     > Sys.setenv("R_TESTS" = "")
     >
     > library(testthat)
     > library(econullnetr)
     >
     > test_check("econullnetr")
     ── 1. Failure: Consistent outputs (@test_generate_edgelist.R#24) ──────────────
     generate_edgelist(s.1, signif.level = 0.9) has changed from known value recorded in 'el1_090'.
     Component "Consumer": Modes: character, numeric
     Component "Consumer": Attributes: < target is NULL, current is list >
     Component "Consumer": target is character, current is factor
    
     ── 2. Failure: Consistent outputs (@test_generate_edgelist.R#26) ──────────────
     generate_edgelist(s.1, signif.level = 0.95) has changed from known value recorded in 'el1_095'.
     Component "Consumer": Modes: character, numeric
     Component "Consumer": Attributes: < target is NULL, current is list >
     Component "Consumer": target is character, current is factor
    
     ── 3. Failure: Consistent outputs (@test_generate_edgelist.R#28) ──────────────
     generate_edgelist(s.1, signif.level = 0.99) has changed from known value recorded in 'el1_099'.
     Component "Consumer": Modes: character, numeric
     Component "Consumer": Attributes: < target is NULL, current is list >
     Component "Consumer": target is character, current is factor
    
     ── 4. Failure: Consistent outputs (@test_generate_edgelist.R#30) ──────────────
     generate_edgelist(...) has changed from known value recorded in 'el2_095'.
     Component "Consumer": Modes: character, numeric
     Component "Consumer": Attributes: < target is NULL, current is list >
     Component "Consumer": target is character, current is factor
    
     ── 5. Failure: Consistent outputs (@test_generate_edgelist.R#33) ──────────────
     generate_edgelist(s.1, signif.level = 0.95, export.null = TRUE) has changed from known value recorded in 'el3_95'.
     Component "Consumer": Modes: character, numeric
     Component "Consumer": Attributes: < target is NULL, current is list >
     Component "Consumer": target is character, current is factor
    
     ══ testthat results ═══════════════════════════════════════════════════════════
     [ OK: 32 | SKIPPED: 10 | WARNINGS: 0 | FAILED: 5 ]
     1. Failure: Consistent outputs (@test_generate_edgelist.R#24)
     2. Failure: Consistent outputs (@test_generate_edgelist.R#26)
     3. Failure: Consistent outputs (@test_generate_edgelist.R#28)
     4. Failure: Consistent outputs (@test_generate_edgelist.R#30)
     5. Failure: Consistent outputs (@test_generate_edgelist.R#33)
    
     Error: testthat unit tests failed
     Execution halted
Flavor: r-devel-linux-x86_64-fedora-gcc

Version: 0.2.0
Check: tests
Result: ERROR
     Running 'testthat.R' [7s]
    Running the tests in 'tests/testthat.R' failed.
    Complete output:
     > Sys.setenv("R_TESTS" = "")
     >
     > library(testthat)
     > library(econullnetr)
     >
     > test_check("econullnetr")
     -- 1. Failure: Consistent outputs (@test_generate_edgelist.R#24) --------------
     generate_edgelist(s.1, signif.level = 0.9) has changed from known value recorded in 'el1_090'.
     Component "Consumer": Modes: character, numeric
     Component "Consumer": Attributes: < target is NULL, current is list >
     Component "Consumer": target is character, current is factor
    
     -- 2. Failure: Consistent outputs (@test_generate_edgelist.R#26) --------------
     generate_edgelist(s.1, signif.level = 0.95) has changed from known value recorded in 'el1_095'.
     Component "Consumer": Modes: character, numeric
     Component "Consumer": Attributes: < target is NULL, current is list >
     Component "Consumer": target is character, current is factor
    
     -- 3. Failure: Consistent outputs (@test_generate_edgelist.R#28) --------------
     generate_edgelist(s.1, signif.level = 0.99) has changed from known value recorded in 'el1_099'.
     Component "Consumer": Modes: character, numeric
     Component "Consumer": Attributes: < target is NULL, current is list >
     Component "Consumer": target is character, current is factor
    
     -- 4. Failure: Consistent outputs (@test_generate_edgelist.R#30) --------------
     generate_edgelist(...) has changed from known value recorded in 'el2_095'.
     Component "Consumer": Modes: character, numeric
     Component "Consumer": Attributes: < target is NULL, current is list >
     Component "Consumer": target is character, current is factor
    
     -- 5. Failure: Consistent outputs (@test_generate_edgelist.R#33) --------------
     generate_edgelist(s.1, signif.level = 0.95, export.null = TRUE) has changed from known value recorded in 'el3_95'.
     Component "Consumer": Modes: character, numeric
     Component "Consumer": Attributes: < target is NULL, current is list >
     Component "Consumer": target is character, current is factor
    
     == testthat results ===========================================================
     [ OK: 32 | SKIPPED: 10 | WARNINGS: 0 | FAILED: 5 ]
     1. Failure: Consistent outputs (@test_generate_edgelist.R#24)
     2. Failure: Consistent outputs (@test_generate_edgelist.R#26)
     3. Failure: Consistent outputs (@test_generate_edgelist.R#28)
     4. Failure: Consistent outputs (@test_generate_edgelist.R#30)
     5. Failure: Consistent outputs (@test_generate_edgelist.R#33)
    
     Error: testthat unit tests failed
     Execution halted
Flavors: r-devel-windows-ix86+x86_64, r-devel-windows-ix86+x86_64-gcc8

Version: 0.2.0
Check: tests
Result: ERROR
     Running ‘testthat.R’ [7s/8s]
    Running the tests in ‘tests/testthat.R’ failed.
    Complete output:
     > Sys.setenv("R_TESTS" = "")
     >
     > library(testthat)
     > library(econullnetr)
     >
     > test_check("econullnetr")
     ── 1. Failure: Consistent outputs (@test_generate_edgelist.R#24) ──────────────
     generate_edgelist(s.1, signif.level = 0.9) has changed from known value recorded in 'el1_090'.
     Component "Consumer": Modes: character, numeric
     Component "Consumer": Attributes: < target is NULL, current is list >
     Component "Consumer": target is character, current is factor
    
     ── 2. Failure: Consistent outputs (@test_generate_edgelist.R#26) ──────────────
     generate_edgelist(s.1, signif.level = 0.95) has changed from known value recorded in 'el1_095'.
     Component "Consumer": Modes: character, numeric
     Component "Consumer": Attributes: < target is NULL, current is list >
     Component "Consumer": target is character, current is factor
    
     ── 3. Failure: Consistent outputs (@test_generate_edgelist.R#28) ──────────────
     generate_edgelist(s.1, signif.level = 0.99) has changed from known value recorded in 'el1_099'.
     Component "Consumer": Modes: character, numeric
     Component "Consumer": Attributes: < target is NULL, current is list >
     Component "Consumer": target is character, current is factor
    
     ── 4. Failure: Consistent outputs (@test_generate_edgelist.R#30) ──────────────
     generate_edgelist(...) has changed from known value recorded in 'el2_095'.
     Component "Consumer": Modes: character, numeric
     Component "Consumer": Attributes: < target is NULL, current is list >
     Component "Consumer": target is character, current is factor
    
     ── 5. Failure: Consistent outputs (@test_generate_edgelist.R#33) ──────────────
     generate_edgelist(s.1, signif.level = 0.95, export.null = TRUE) has changed from known value recorded in 'el3_95'.
     Component "Consumer": Modes: character, numeric
     Component "Consumer": Attributes: < target is NULL, current is list >
     Component "Consumer": target is character, current is factor
    
     ══ testthat results ═══════════════════════════════════════════════════════════
     [ OK: 32 | SKIPPED: 10 | WARNINGS: 0 | FAILED: 5 ]
     1. Failure: Consistent outputs (@test_generate_edgelist.R#24)
     2. Failure: Consistent outputs (@test_generate_edgelist.R#26)
     3. Failure: Consistent outputs (@test_generate_edgelist.R#28)
     4. Failure: Consistent outputs (@test_generate_edgelist.R#30)
     5. Failure: Consistent outputs (@test_generate_edgelist.R#33)
    
     Error: testthat unit tests failed
     Execution halted
Flavor: r-patched-linux-x86_64

Version: 0.2.0
Check: package dependencies
Result: NOTE
    Package suggested but not available for checking: ‘vdiffr’
Flavor: r-patched-solaris-x86

Version: 0.2.0
Check: tests
Result: ERROR
     Running ‘testthat.R’ [13s/17s]
    Running the tests in ‘tests/testthat.R’ failed.
    Complete output:
     > Sys.setenv("R_TESTS" = "")
     >
     > library(testthat)
     > library(econullnetr)
     >
     > test_check("econullnetr")
     ── 1. Failure: Consistent outputs (@test_generate_edgelist.R#24) ──────────────
     generate_edgelist(s.1, signif.level = 0.9) has changed from known value recorded in 'el1_090'.
     Component "Consumer": Modes: character, numeric
     Component "Consumer": Attributes: < target is NULL, current is list >
     Component "Consumer": target is character, current is factor
    
     ── 2. Failure: Consistent outputs (@test_generate_edgelist.R#26) ──────────────
     generate_edgelist(s.1, signif.level = 0.95) has changed from known value recorded in 'el1_095'.
     Component "Consumer": Modes: character, numeric
     Component "Consumer": Attributes: < target is NULL, current is list >
     Component "Consumer": target is character, current is factor
    
     ── 3. Failure: Consistent outputs (@test_generate_edgelist.R#28) ──────────────
     generate_edgelist(s.1, signif.level = 0.99) has changed from known value recorded in 'el1_099'.
     Component "Consumer": Modes: character, numeric
     Component "Consumer": Attributes: < target is NULL, current is list >
     Component "Consumer": target is character, current is factor
    
     ── 4. Failure: Consistent outputs (@test_generate_edgelist.R#30) ──────────────
     generate_edgelist(...) has changed from known value recorded in 'el2_095'.
     Component "Consumer": Modes: character, numeric
     Component "Consumer": Attributes: < target is NULL, current is list >
     Component "Consumer": target is character, current is factor
    
     ── 5. Failure: Consistent outputs (@test_generate_edgelist.R#33) ──────────────
     generate_edgelist(s.1, signif.level = 0.95, export.null = TRUE) has changed from known value recorded in 'el3_95'.
     Component "Consumer": Modes: character, numeric
     Component "Consumer": Attributes: < target is NULL, current is list >
     Component "Consumer": target is character, current is factor
    
     ══ testthat results ═══════════════════════════════════════════════════════════
     [ OK: 32 | SKIPPED: 10 | WARNINGS: 0 | FAILED: 5 ]
     1. Failure: Consistent outputs (@test_generate_edgelist.R#24)
     2. Failure: Consistent outputs (@test_generate_edgelist.R#26)
     3. Failure: Consistent outputs (@test_generate_edgelist.R#28)
     4. Failure: Consistent outputs (@test_generate_edgelist.R#30)
     5. Failure: Consistent outputs (@test_generate_edgelist.R#33)
    
     Error: testthat unit tests failed
     Execution halted
Flavor: r-patched-solaris-x86