CRAN Package Check Results for Package huxtable

Last updated on 2020-06-06 02:07:00 CEST.

Flavor Version Tinstall Tcheck Ttotal Status Flags
r-devel-linux-x86_64-debian-clang 4.7.1 9.96 133.27 143.23 ERROR
r-devel-linux-x86_64-debian-gcc 4.7.1 9.49 100.02 109.51 ERROR
r-devel-linux-x86_64-fedora-clang 4.7.1 174.90 ERROR
r-devel-linux-x86_64-fedora-gcc 4.7.1 176.42 ERROR
r-devel-windows-ix86+x86_64 4.7.1 29.00 212.00 241.00 ERROR
r-patched-linux-x86_64 4.7.1 11.96 131.17 143.13 ERROR
r-patched-solaris-x86 4.7.1 207.60 ERROR
r-release-linux-x86_64 4.7.1 11.47 131.35 142.82 ERROR
r-release-osx-x86_64 4.7.1 OK
r-release-windows-ix86+x86_64 4.7.1 31.00 157.00 188.00 ERROR
r-oldrel-osx-x86_64 4.7.1 OK
r-oldrel-windows-ix86+x86_64 4.7.1 27.00 200.00 227.00 ERROR

Check Details

Version: 4.7.1
Check: tests
Result: ERROR
     Running 'testthat.R' [28s/31s]
    Running the tests in 'tests/testthat.R' failed.
    Complete output:
     > library(testthat)
     > library(huxtable)
     >
     >
     > we_are_in_R_CMD_check <- TRUE
     > test_check("huxtable")
     -- 1. Failure: Quick output functions create files (@test-quick-output.R#33) --
     `quick_pptx(m, dfr, ht, file = tf, open = FALSE)` produced warnings.
    
     [WARNING] This document format requires a nonempty <title> element.
     Defaulting to 'markdown-examplef7e2c78170c.utf8' as the title.
     To specify a title, use 'title' in metadata or --metadata title="...".
     [WARNING] This document format requires a nonempty <title> element.
     Defaulting to 'markdown-examplef7e1610e800.utf8' as the title.
     To specify a title, use 'title' in metadata or --metadata title="...".
     [WARNING] This document format requires a nonempty <title> element.
     Defaulting to 'markdown-examplef7e4d9849af.utf8' as the title.
     To specify a title, use 'title' in metadata or --metadata title="...".
     == testthat results ===========================================================
     [ OK: 898 | SKIPPED: 65 | WARNINGS: 1 | FAILED: 1 ]
     1. Failure: Quick output functions create files (@test-quick-output.R#33)
    
     Error: testthat unit tests failed
     Execution halted
Flavor: r-devel-linux-x86_64-debian-clang

Version: 4.7.1
Check: tests
Result: ERROR
     Running ‘testthat.R’ [22s/33s]
    Running the tests in ‘tests/testthat.R’ failed.
    Complete output:
     > library(testthat)
     > library(huxtable)
     >
     >
     > we_are_in_R_CMD_check <- TRUE
     > test_check("huxtable")
     ── 1. Failure: Quick output functions create files (@test-quick-output.R#33) ──
     `quick_pptx(m, dfr, ht, file = tf, open = FALSE)` produced warnings.
    
     [WARNING] This document format requires a nonempty <title> element.
     Defaulting to 'markdown-example37cb4f2e1b82.utf8' as the title.
     To specify a title, use 'title' in metadata or --metadata title="...".
     [WARNING] This document format requires a nonempty <title> element.
     Defaulting to 'markdown-example37cb6f89d084.utf8' as the title.
     To specify a title, use 'title' in metadata or --metadata title="...".
     [WARNING] This document format requires a nonempty <title> element.
     Defaulting to 'markdown-example37cbfcf6ef5.utf8' as the title.
     To specify a title, use 'title' in metadata or --metadata title="...".
     ══ testthat results ═══════════════════════════════════════════════════════════
     [ OK: 898 | SKIPPED: 65 | WARNINGS: 1 | FAILED: 1 ]
     1. Failure: Quick output functions create files (@test-quick-output.R#33)
    
     Error: testthat unit tests failed
     Execution halted
Flavor: r-devel-linux-x86_64-debian-gcc

Version: 4.7.1
Check: tests
Result: ERROR
     Running ‘testthat.R’ [30s/35s]
    Running the tests in ‘tests/testthat.R’ failed.
    Complete output:
     > library(testthat)
     > library(huxtable)
     >
     >
     > we_are_in_R_CMD_check <- TRUE
     > test_check("huxtable")
     ── 1. Failure: Quick output functions create files (@test-quick-output.R#33) ──
     `quick_pptx(m, dfr, ht, file = tf, open = FALSE)` produced warnings.
    
     [WARNING] This document format requires a nonempty <title> element.
     Defaulting to 'markdown-exampled123d2afa17.utf8' as the title.
     To specify a title, use 'title' in metadata or --metadata title="...".
     [WARNING] This document format requires a nonempty <title> element.
     Defaulting to 'markdown-exampled1298182bd.utf8' as the title.
     To specify a title, use 'title' in metadata or --metadata title="...".
     [WARNING] This document format requires a nonempty <title> element.
     Defaulting to 'markdown-exampled123c3f6caa.utf8' as the title.
     To specify a title, use 'title' in metadata or --metadata title="...".
     ══ testthat results ═══════════════════════════════════════════════════════════
     [ OK: 898 | SKIPPED: 65 | WARNINGS: 1 | FAILED: 1 ]
     1. Failure: Quick output functions create files (@test-quick-output.R#33)
    
     Error: testthat unit tests failed
     Execution halted
Flavor: r-devel-linux-x86_64-fedora-clang

Version: 4.7.1
Check: tests
Result: ERROR
     Running ‘testthat.R’ [39s/48s]
    Running the tests in ‘tests/testthat.R’ failed.
    Complete output:
     > library(testthat)
     > library(huxtable)
     >
     >
     > we_are_in_R_CMD_check <- TRUE
     > test_check("huxtable")
     ── 1. Failure: Quick output functions create files (@test-quick-output.R#33) ──
     `quick_pptx(m, dfr, ht, file = tf, open = FALSE)` produced warnings.
    
     [WARNING] This document format requires a nonempty <title> element.
     Defaulting to 'markdown-example92dc1c65a271.utf8' as the title.
     To specify a title, use 'title' in metadata or --metadata title="...".
     [WARNING] This document format requires a nonempty <title> element.
     Defaulting to 'markdown-example92dc47bf8446.utf8' as the title.
     To specify a title, use 'title' in metadata or --metadata title="...".
     [WARNING] This document format requires a nonempty <title> element.
     Defaulting to 'markdown-example92dc519ba5d1.utf8' as the title.
     To specify a title, use 'title' in metadata or --metadata title="...".
     ══ testthat results ═══════════════════════════════════════════════════════════
     [ OK: 898 | SKIPPED: 65 | WARNINGS: 1 | FAILED: 1 ]
     1. Failure: Quick output functions create files (@test-quick-output.R#33)
    
     Error: testthat unit tests failed
     Execution halted
Flavor: r-devel-linux-x86_64-fedora-gcc

Version: 4.7.1
Check: tests
Result: ERROR
     Running 'testthat.R' [38s]
    Running the tests in 'tests/testthat.R' failed.
    Complete output:
     > library(testthat)
     > library(huxtable)
     >
     >
     > we_are_in_R_CMD_check <- TRUE
     > test_check("huxtable")
     -- 1. Failure: Quick output functions create files (@test-quick-output.R#33) --
     `quick_pptx(m, dfr, ht, file = tf, open = FALSE)` produced warnings.
    
     == testthat results ===========================================================
     [ OK: 897 | SKIPPED: 66 | WARNINGS: 1 | FAILED: 1 ]
     1. Failure: Quick output functions create files (@test-quick-output.R#33)
    
     Error: testthat unit tests failed
     Execution halted
Flavor: r-devel-windows-ix86+x86_64

Version: 4.7.1
Check: tests
Result: ERROR
     Running ‘testthat.R’ [27s/31s]
    Running the tests in ‘tests/testthat.R’ failed.
    Complete output:
     > library(testthat)
     > library(huxtable)
     >
     >
     > we_are_in_R_CMD_check <- TRUE
     > test_check("huxtable")
     ── 1. Failure: Quick output functions create files (@test-quick-output.R#33) ──
     `quick_pptx(m, dfr, ht, file = tf, open = FALSE)` produced warnings.
    
     [WARNING] This document format requires a nonempty <title> element.
     Defaulting to 'markdown-example3d62454b2c43.utf8' as the title.
     To specify a title, use 'title' in metadata or --metadata title="...".
     [WARNING] This document format requires a nonempty <title> element.
     Defaulting to 'markdown-example3d6271dde6e7.utf8' as the title.
     To specify a title, use 'title' in metadata or --metadata title="...".
     [WARNING] This document format requires a nonempty <title> element.
     Defaulting to 'markdown-example3d622d8edaaa.utf8' as the title.
     To specify a title, use 'title' in metadata or --metadata title="...".
     ══ testthat results ═══════════════════════════════════════════════════════════
     [ OK: 898 | SKIPPED: 65 | WARNINGS: 1 | FAILED: 1 ]
     1. Failure: Quick output functions create files (@test-quick-output.R#33)
    
     Error: testthat unit tests failed
     Execution halted
Flavor: r-patched-linux-x86_64

Version: 4.7.1
Check: tests
Result: ERROR
     Running ‘testthat.R’ [33s/38s]
    Running the tests in ‘tests/testthat.R’ failed.
    Complete output:
     > library(testthat)
     > library(huxtable)
     >
     >
     > we_are_in_R_CMD_check <- TRUE
     > test_check("huxtable")
     ── 1. Failure: Quick output functions create files (@test-quick-output.R#33) ──
     `quick_pptx(m, dfr, ht, file = tf, open = FALSE)` produced warnings.
    
     ══ testthat results ═══════════════════════════════════════════════════════════
     [ OK: 890 | SKIPPED: 60 | WARNINGS: 1 | FAILED: 1 ]
     1. Failure: Quick output functions create files (@test-quick-output.R#33)
    
     Error: testthat unit tests failed
     Execution halted
Flavor: r-patched-solaris-x86

Version: 4.7.1
Check: tests
Result: ERROR
     Running ‘testthat.R’ [28s/31s]
    Running the tests in ‘tests/testthat.R’ failed.
    Complete output:
     > library(testthat)
     > library(huxtable)
     >
     >
     > we_are_in_R_CMD_check <- TRUE
     > test_check("huxtable")
     ── 1. Failure: Quick output functions create files (@test-quick-output.R#33) ──
     `quick_pptx(m, dfr, ht, file = tf, open = FALSE)` produced warnings.
    
     [WARNING] This document format requires a nonempty <title> element.
     Defaulting to 'markdown-example2c284055eb82.utf8' as the title.
     To specify a title, use 'title' in metadata or --metadata title="...".
     [WARNING] This document format requires a nonempty <title> element.
     Defaulting to 'markdown-example2c287f05e678.utf8' as the title.
     To specify a title, use 'title' in metadata or --metadata title="...".
     [WARNING] This document format requires a nonempty <title> element.
     Defaulting to 'markdown-example2c28cb9dc9e.utf8' as the title.
     To specify a title, use 'title' in metadata or --metadata title="...".
     ══ testthat results ═══════════════════════════════════════════════════════════
     [ OK: 898 | SKIPPED: 65 | WARNINGS: 1 | FAILED: 1 ]
     1. Failure: Quick output functions create files (@test-quick-output.R#33)
    
     Error: testthat unit tests failed
     Execution halted
Flavor: r-release-linux-x86_64

Version: 4.7.1
Check: tests
Result: ERROR
     Running 'testthat.R' [24s]
    Running the tests in 'tests/testthat.R' failed.
    Complete output:
     > library(testthat)
     > library(huxtable)
     >
     >
     > we_are_in_R_CMD_check <- TRUE
     > test_check("huxtable")
     -- 1. Failure: Quick output functions create files (@test-quick-output.R#33) --
     `quick_pptx(m, dfr, ht, file = tf, open = FALSE)` produced warnings.
    
     == testthat results ===========================================================
     [ OK: 897 | SKIPPED: 66 | WARNINGS: 1 | FAILED: 1 ]
     1. Failure: Quick output functions create files (@test-quick-output.R#33)
    
     Error: testthat unit tests failed
     Execution halted
Flavor: r-release-windows-ix86+x86_64

Version: 4.7.1
Check: tests
Result: ERROR
     Running 'testthat.R' [35s]
    Running the tests in 'tests/testthat.R' failed.
    Complete output:
     > library(testthat)
     > library(huxtable)
     >
     >
     > we_are_in_R_CMD_check <- TRUE
     > test_check("huxtable")
     -- 1. Failure: Quick output functions create files (@test-quick-output.R#33) --
     `quick_pptx(m, dfr, ht, file = tf, open = FALSE)` produced warnings.
    
     == testthat results ===========================================================
     [ OK: 897 | SKIPPED: 66 | WARNINGS: 1 | FAILED: 1 ]
     1. Failure: Quick output functions create files (@test-quick-output.R#33)
    
     Error: testthat unit tests failed
     Execution halted
Flavor: r-oldrel-windows-ix86+x86_64